"/home/worsch/ops-warden/.venv/bin/python" -I scripts/run_unit_tests.py --phase-memory-root "/home/worsch/phase-memory" --netkingdom-root /tmp/custodian-keycape-current-client-r1/net-kingdom-source -q
..........................F............................................. [  9%]
........................................................................ [ 18%]
........................................................................ [ 27%]
........................................................................ [ 36%]
........................................................................ [ 45%]
........................................................................ [ 54%]
........................................................................ [ 63%]
........................................................................ [ 72%]
........................................................................ [ 81%]
........................................................................ [ 90%]
........................................................................ [ 99%]
..                                                                       [100%]
=================================== FAILURES ===================================
________________ TestGeneratedArtifact.test_artifact_is_current ________________

self = <tests.test_agent_read_boundary_check.TestGeneratedArtifact object at 0x7855681a9a90>

    def test_artifact_is_current(self):
        import subprocess
    
        result = subprocess.run(
            ["python3", str(REPO / "scripts" / "emit_high_risk_paths.py"), "--check"],
            capture_output=True, text=True, timeout=60,
        )
>       assert result.returncode == 0, (
            f"{result.stdout}{result.stderr}\n"
            "Re-run scripts/emit_high_risk_paths.py and commit the result."
        )
E       AssertionError: STALE: /tmp/custodian-keycape-current-client-r1/warden-source/registry/generated/high-risk-data-paths.yaml does not match the catalog. Re-run without --check.
E         
E         Re-run scripts/emit_high_risk_paths.py and commit the result.
E       assert 1 == 0
E        +  where 1 = CompletedProcess(args=['/home/worsch/ops-warden/.venv/bin/python', '-I', '/tmp/custodian-keycape-current-client-r1/war...-source/registry/generated/high-risk-data-paths.yaml does not match the catalog. Re-run without --check.\n', stderr='').returncode

tests/test_agent_read_boundary_check.py:117: AssertionError
=========================== short test summary info ============================
FAILED tests/test_agent_read_boundary_check.py::TestGeneratedArtifact::test_artifact_is_current
1 failed, 793 passed, 4 deselected in 69.56s (0:01:09)
make: *** [Makefile:47: test] Error 1
