F....F....                               [100%]
=================================== FAILURES ===================================
_ Admit13TypeTests.test_agent_mint_is_refused_after_fixture_map_acknowledges_descriptor _

self = <test_admit_1_3_type.Admit13TypeTests testMethod=test_agent_mint_is_refused_after_fixture_map_acknowledges_descriptor>

    def test_agent_mint_is_refused_after_fixture_map_acknowledges_descriptor(self):
        # A committed-map mismatch cannot exercise the independent mint guard.
        mint = replace(self.descriptors['mint-secret'], actor='agent')
        typ = yaml.safe_load(with_status('acknowledged'))
        typ['spec']['execution_descriptors']['mint-secret'] = digest(c.encode(mint))
>       with pinned_13(), self.assertRaisesRegex(Refused, 'agent mint is forbidden'):
E       AssertionError: Refused not raised

test_admit_1_3_type.py:150: AssertionError
___ Admit13TypeTests.test_human_mint_is_refused_with_agent_runtime_identity ____

self = <test_admit_1_3_type.Admit13TypeTests testMethod=test_human_mint_is_refused_with_agent_runtime_identity>

    def test_human_mint_is_refused_with_agent_runtime_identity(self):
        mint = self.descriptors['mint-secret']
        self.assertEqual(mint.actor, 'human')
>       with pinned_13(), self.assertRaisesRegex(Refused, 'agent mint is forbidden'):
E       AssertionError: Refused not raised

test_admit_1_3_type.py:156: AssertionError
=========================== short test summary info ============================
FAILED test_admit_1_3_type.py::Admit13TypeTests::test_agent_mint_is_refused_after_fixture_map_acknowledges_descriptor
FAILED test_admit_1_3_type.py::Admit13TypeTests::test_human_mint_is_refused_with_agent_runtime_identity
2 failed, 8 passed, 32 subtests passed in 5.72s
