test_revoked_handover_session_cannot_authorize_later_inverse (__main__.InverseAuthorityTests.test_revoked_handover_session_cannot_authorize_later_inverse) ... FAIL
test_failure_unwind_must_not_reuse_revoked_handover_session (__main__.InverseAuthorityTests.test_failure_unwind_must_not_reuse_revoked_handover_session) ... FAIL
test_fresh_scoped_inverse_session_closed_after_restore (__main__.InverseAuthorityTests.test_fresh_scoped_inverse_session_closed_after_restore) ... FAIL

======================================================================
FAIL: test_revoked_handover_session_cannot_authorize_later_inverse (__main__.InverseAuthorityTests.test_revoked_handover_session_cannot_authorize_later_inverse)
----------------------------------------------------------------------
Traceback (most recent call last):
  File "/tmp/nk48-apps-f3-review/test_inverse_authority.py", line 21, in test_revoked_handover_session_cannot_authorize_later_inverse
    with self.assertRaisesRegex(Refused, 'fresh attended'):
AssertionError: Refused not raised

======================================================================
FAIL: test_failure_unwind_must_not_reuse_revoked_handover_session (__main__.InverseAuthorityTests.test_failure_unwind_must_not_reuse_revoked_handover_session)
----------------------------------------------------------------------
warden.case_receipt_state.Refused: consumer verification contract differs

During handling of the above exception, another exception occurred:

Traceback (most recent call last):
  File "/tmp/nk48-apps-f3-review/test_inverse_authority.py", line 34, in test_failure_unwind_must_not_reuse_revoked_handover_session
    with self.assertRaisesRegex(Refused, 'fresh attended'):
AssertionError: "fresh attended" does not match "consumer verification contract differs"

======================================================================
FAIL: test_fresh_scoped_inverse_session_closed_after_restore (__main__.InverseAuthorityTests.test_fresh_scoped_inverse_session_closed_after_restore)
----------------------------------------------------------------------
Traceback (most recent call last):
  File "/tmp/nk48-apps-f3-review/test_inverse_authority.py", line 54, in test_fresh_scoped_inverse_session_closed_after_restore
    self.assertEqual(events, ['fresh-scoped-authority', 'inverse-session-revoked'])
AssertionError: Lists differ: [] != ['fresh-scoped-authority', 'inverse-session-revoked']

Second list contains 2 additional elements.
First extra element 0:
'fresh-scoped-authority'

- []
+ ['fresh-scoped-authority', 'inverse-session-revoked']

----------------------------------------------------------------------
Ran 3 tests in 0.013s

FAILED (failures=3)
